Target
Signal transducer and activator of transcription 1-alpha/beta
Ligand
BDBM37164
Substrate
Meas. Tech.
Dose response counterscreen assay for STAT3 activators: cell-based high throughput assay to measure STAT1 activation
EC50
>55700±n/a nM
Citation
 PubChem, PC Dose response counterscreen assay for STAT3 activators: cell-based high throughput assay to measure STAT1 activation PubChem Bioassay (2008)[AID] 
Target
Name:
Signal transducer and activator of transcription 1-alpha/beta
Synonyms:
STAT1 Signal transducer and activator of transcription 1-alpha/beta Transcription factor ISGF-3 components p91/p84 | signal transducer and activator of transcription 1 isoform alpha
Type:
Cytosolic Transcription Factor
Mol. Mass.:
87327.69
Organism:
Homo sapiens (Human)
Description:
Stat1 was expressed in sf9 cells from a baculovirus encoding the recombinant proteins. Stat1 dimer binds to DNA.
Residue:
750
  
Inhibitor
Name:
BDBM37164
Synonyms:
(E)-2-[4-(2,3-dihydroindol-1-ylsulfonyl)-3-methyl-1,2-oxazol-5-yl]-N,N-dimethyl-ethenamine (E)-2-[4-(2,3-dihydroindol-1-ylsulfonyl)-3-methyl-5-isoxazolyl]-N,N-dimethylethenamine SMR000097229 cid_5308093
Type:
Small organic molecule
Emp. Form.:
C16H19N3O3S
Mol. Mass.:
333.405
SMILES:
CN(C)\C=C\c1onc(C)c1S(=O)(=O)N1CCc2ccccc12
: