Target
Signal transducer and activator of transcription 1-alpha/beta
Ligand
BDBM43585
Substrate
Meas. Tech.
Dose response counterscreen assay for STAT3 activators: cell-based high throughput assay to measure STAT1 activation
EC50
>55700±n/a nM
Citation
 PubChem, PC Dose response counterscreen assay for STAT3 activators: cell-based high throughput assay to measure STAT1 activation PubChem Bioassay (2008)[AID] 
Target
Name:
Signal transducer and activator of transcription 1-alpha/beta
Synonyms:
STAT1 Signal transducer and activator of transcription 1-alpha/beta Transcription factor ISGF-3 components p91/p84 | signal transducer and activator of transcription 1 isoform alpha
Type:
Cytosolic Transcription Factor
Mol. Mass.:
87327.69
Organism:
Homo sapiens (Human)
Description:
Stat1 was expressed in sf9 cells from a baculovirus encoding the recombinant proteins. Stat1 dimer binds to DNA.
Residue:
750
  
Inhibitor
Name:
BDBM43585
Synonyms:
3-(4-chlorophenyl)-1-methyl-N-[3-(4-methyl-1-piperazinyl)propyl]-5-thieno[2,3-c]pyrazolecarboxamide 3-(4-chlorophenyl)-1-methyl-N-[3-(4-methylpiperazino)propyl]thieno[2,3-c]pyrazole-5-carboxamide SMR000094249 | cid_5308230
Type:
Small organic molecule
Emp. Form.:
C21H26ClN5OS
Mol. Mass.:
431.982
SMILES:
CN1CCN(CCCNC(=O)c2cc3c(nn(C)c3s2)-c2ccc(Cl)cc2)CC1
: