Target
Wee1-like protein kinase
Ligand
BDBM43757
Substrate
Meas. Tech.
Dose Response Cell-based Assay for Inhibitors of Wee1 Degradation
EC50
>49750±n/a nM
Citation
 PubChem, PC Dose Response Cell-based Assay for Inhibitors of Wee1 Degradation PubChem Bioassay (2008)[AID] 
Target
Name:
Wee1-like protein kinase
Synonyms:
Serine/threonine-protein kinase WEE1 WEE1 homolog (S. pombe) | WEE1_HUMAN
Type:
PROTEIN
Mol. Mass.:
71599.12
Organism:
Homo sapiens (Human)
Description:
ChEMBL_1445054
Residue:
646
  
Inhibitor
Name:
BDBM43757
Synonyms:
2-furanyl-(8-methyl-2-sulfanylidene-[1,2,4]triazolo[1,5-a]pyridin-3-yl)methanone Furan-2-yl-(8-methyl-2-thioxo-2H-[1,2,4]triazolo[1,5-a]pyridin-3-yl)-methanone SMR000146487 furan-2-yl-(8-methyl-2-sulfanylidene-[1,2,4]triazolo[1,5-a]pyridin-3-yl)methanone
Type:
Small organic molecule
Emp. Form.:
C12H9N3O2S
Mol. Mass.:
259.284
SMILES:
Cc1cccn2n(C(=O)c3ccco3)c(=S)nc12
: