Target
Glycylpeptide N-tetradecanoyltransferase
Ligand
BDBM96235
Substrate
Meas. Tech.
Inhibition Assay
Ki
4.2e+2±n/a nM
Citation
 Sogabe, SMasubuchi, MSakata, KFukami, TAMorikami, KShiratori, YEbiike, HKawasaki, KAoki, YShimma, ND'Arcy, AWinkler, FKBanner, DWOhtsuka, T Crystal structures of Candida albicans N-myristoyltransferase with two distinct inhibitors. Chem Biol 9:1119-28 (2002)  
Target
Name:
Glycylpeptide N-tetradecanoyltransferase
Synonyms:
2.3.1.97 Myristoyl-CoA:protein N-myristoyltransferase Myristoyl-CoA:protein N-myristoyltransferase (Nmt D112A)) Myristoyl-CoA:protein N-myristoyltransferase (Nmt F115A)) Myristoyl-CoA:protein N-myristoyltransferase (Nmt F240A)) Myristoyl-CoA:protein N-myristoyltransferase (Nmt F339S)) Myristoyl-CoA:protein N-myristoyltransferase (Nmt H227A)) Myristoyl-CoA:protein N-myristoyltransferase (Nmt I352A)) Myristoyl-CoA:protein N-myristoyltransferase (Nmt L451A)) Myristoyl-CoA:protein N-myristoyltransferase (Nmt N175A)) Myristoyl-CoA:protein N-myristoyltransferase (Nmt S241A)) Myristoyl-CoA:protein N-myristoyltransferase (Nmt T211A)) Myristoyl-CoA:protein N-myristoyltransferase (Nmt W232A)) Myristoyl-CoA:protein N-myristoyltransferase (Nmt Y119A)) Myristoyl-CoA:protein N-myristoyltransferase (Nmt Y256A)) Myristoyl-CoA:protein N-myristoyltransferase (Nmt) NMT1 Peptide N-myristoyltransferase | Peptide N-myristoyltransferase 1
Type:
Enzyme
Mol. Mass.:
51875.96
Organism:
Candida albicans (Yeast)
Description:
P30418
Residue:
451
  
Inhibitor
Name:
BDBM96235
Synonyms:
4-[2-hydroxy-3-(isopropylamino)propoxy]-3-methyl-coumarilic acid ethyl ester;hydrochloride CHEMBL53849 Non peptidic, 1 cid_6602742 ethyl 4-[2-hydroxy-3-(propan-2-ylamino)propoxy]-3-methyl-1-benzofuran-2-carboxylate;hydrochloride
Type:
Small organic molecule
Emp. Form.:
C18H25NO5
Mol. Mass.:
335.3948
SMILES:
CCOC(=O)c1oc2cccc(OCC(O)CNC(C)C)c2c1C
: