Target
Solute carrier family 12 member 5
Ligand
BDBM43900
Substrate
Meas. Tech.
Identification of Novel Modulators of Cl- dependent Transport Process via HTS: Rubidium Flux
IC50
7900±n/a nM
Citation
 PubChem, PC Identification of Novel Modulators of Cl- dependent Transport Process via HTS: Rubidium Flux PubChem Bioassay (2009)[AID] 
Target
Name:
Solute carrier family 12 member 5
Synonyms:
Electroneutral potassium-chloride cotransporter 2 KCC2 Neuronal K-Cl cotransporter SLC12A5 electroneutral potassium-chloride cotransporter KCC2 | hKCC2
Type:
PROTEIN
Mol. Mass.:
126185.18
Organism:
Homo sapiens (Human)
Description:
ChEMBL_828024
Residue:
1139
  
Inhibitor
Name:
BDBM43900
Synonyms:
2-[[(E)-1-oxo-3-phenylprop-2-enyl]amino]-4-phenyl-3-thiophenecarboxylic acid 4-phenyl-2-[[(E)-3-phenylprop-2-enoyl]amino]thiophene-3-carboxylic acid cid_950131
Type:
Small organic molecule
Emp. Form.:
C20H15NO3S
Mol. Mass.:
349.403
SMILES:
OC(=O)c1c(NC(=O)\C=C\c2ccccc2)scc1-c1ccccc1
: