Target
Ephrin type-A receptor 4
Ligand
BDBM44530
Substrate
Meas. Tech.
Counter Screen for Placental Alkaline Phosphatase-based Assays Positives
IC50
>50000±0 nM
Citation
 PubChem, PC Counter Screen for Placental Alkaline Phosphatase-based Assays Positives PubChem Bioassay (2008)[AID] 
Target
Name:
Ephrin type-A receptor 4
Synonyms:
EPHA4_MOUSE Epha4 Sek1
Type:
Enzyme Catalytic Domain
Mol. Mass.:
109812.17
Organism:
Mus musculus
Description:
gi_34328113
Residue:
986
  
Inhibitor
Name:
BDBM44530
Synonyms:
3-keto-7-phenyl-5-(2-thienyl)-2-(3,4,5-trimethoxybenzylidene)-5H-thiazolo[3,2-a]pyrimidine-6-carboxylic acid ethyl ester MLS000572607 cid_2885102 ethyl 3-oxo-7-phenyl-5-(2-thienyl)-2-(3,4,5-trimethoxybenzylidene)-2,3-dihydro-5H-[1,3]thiazolo[3,2-a]pyrimidine-6-carboxylate | ethyl 3-oxo-7-phenyl-5-thiophen-2-yl-2-[(3,4,5-trimethoxyphenyl)methylidene]-5H-[1,3]thiazolo[3,2-a]pyrimidine-6-carboxylate
Type:
Small organic molecule
Emp. Form.:
C29H26N2O6S2
Mol. Mass.:
562.657
SMILES:
CCOC(=O)C1=C(N=c2sc(=Cc3cc(OC)c(OC)c(OC)c3)c(=O)n2C1c1cccs1)c1ccccc1
: