Target
Multidrug resistance-associated protein 1
Ligand
BDBM37361
Substrate
Meas. Tech.
Identification of Molecular Probes that Activate MRP-1 - Dose Response
EC50
1158±n/a nM
Citation
 PubChem, PC Identification of Molecular Probes that Activate MRP-1 - Dose Response PubChem Bioassay (2007)[AID] 
Target
Name:
Multidrug resistance-associated protein 1
Synonyms:
7.6.2.2 ABCC1 ATP-binding cassette, sub-family C, member 1 isoform 1 LTC4 transporter MRP MRP1_HUMAN
Type:
Mol. Mass.:
171597.72
Organism:
Homo sapiens (Human)
Description:
P33527
Residue:
1531
  
Inhibitor
Name:
BDBM37361
Synonyms:
8-[2-(4-Methoxy-phenyl)-5-phenyl-pyrazolo[1,5-a]pyrimidin-7-yl]-1,4-dioxa-8-aza-spiro[4.5]decane 8-[2-(4-methoxyphenyl)-5-phenyl-pyrazolo[1,5-a]pyrimidin-7-yl]-1,4-dioxa-8-azaspiro[4.5]decane MLS000035341 cid_650554
Type:
Small organic molecule
Emp. Form.:
C26H26N4O3
Mol. Mass.:
442.5096
SMILES:
COc1ccc(cc1)-c1cc2nc(cc(N3CCC4(CC3)OCCO4)n2n1)-c1ccccc1
: