Target
Multidrug resistance-associated protein 1
Ligand
BDBM44653
Substrate
Meas. Tech.
Identification of Molecular Probes that Activate MRP-1 - Dose Response
EC50
3413±n/a nM
Citation
 PubChem, PC Identification of Molecular Probes that Activate MRP-1 - Dose Response PubChem Bioassay (2007)[AID] 
Target
Name:
Multidrug resistance-associated protein 1
Synonyms:
7.6.2.2 ABCC1 ATP-binding cassette, sub-family C, member 1 isoform 1 LTC4 transporter MRP MRP1_HUMAN
Type:
Mol. Mass.:
171597.72
Organism:
Homo sapiens (Human)
Description:
P33527
Residue:
1531
  
Inhibitor
Name:
BDBM44653
Synonyms:
3-(2,2-dimethylpropanoylamino)-N-(4-methoxyphenyl)-1-benzofuran-2-carboxamide 3-[(2,2-dimethylpropanoyl)amino]-N-(4-methoxyphenyl)-1-benzofuran-2-carboxamide N-(4-methoxyphenyl)-3-(pivaloylamino)coumarilamide cid_3241060
Type:
Small organic molecule
Emp. Form.:
C21H22N2O4
Mol. Mass.:
366.4104
SMILES:
COc1ccc(NC(=O)c2oc3ccccc3c2NC(=O)C(C)(C)C)cc1
: