Target
Multidrug resistance-associated protein 1
Ligand
BDBM44818
Substrate
Meas. Tech.
Identification of Molecular Probes that Activate MRP-1 - Dose Response
EC50
3749±n/a nM
Citation
 PubChem, PC Identification of Molecular Probes that Activate MRP-1 - Dose Response PubChem Bioassay (2007)[AID] 
Target
Name:
Multidrug resistance-associated protein 1
Synonyms:
7.6.2.2 ABCC1 ATP-binding cassette, sub-family C, member 1 isoform 1 LTC4 transporter MRP MRP1_HUMAN
Type:
Mol. Mass.:
171597.72
Organism:
Homo sapiens (Human)
Description:
P33527
Residue:
1531
  
Inhibitor
Name:
BDBM44818
Synonyms:
2,3-bis(oxidanyl)butanedioic acid;4-[(1R)-2-(methylamino)-1-oxidanyl-ethyl]benzene-1,2-diol 4-[(1R)-1-hydroxy-2-(methylamino)ethyl]pyrocatechol;tartaric acid MLS000028381 cid_6852374
Type:
Small organic molecule
Emp. Form.:
C9H13NO3
Mol. Mass.:
183.2044
SMILES:
CNC[C@H](O)c1ccc(O)c(O)c1
: