Target
Multidrug resistance-associated protein 1
Ligand
BDBM44897
Substrate
Meas. Tech.
Identification of Molecular Probes that Activate MRP-1 - Dose Response
EC50
7271±n/a nM
Citation
 PubChem, PC Identification of Molecular Probes that Activate MRP-1 - Dose Response PubChem Bioassay (2007)[AID] 
Target
Name:
Multidrug resistance-associated protein 1
Synonyms:
7.6.2.2 ABCC1 ATP-binding cassette, sub-family C, member 1 isoform 1 LTC4 transporter MRP MRP1_HUMAN
Type:
Mol. Mass.:
171597.72
Organism:
Homo sapiens (Human)
Description:
P33527
Residue:
1531
  
Inhibitor
Name:
BDBM44897
Synonyms:
MLS000522378 N-[1-[(4-chlorophenyl)methyl]-5-methyl-3-pyrazolyl]-5-propan-2-yl-3-isoxazolecarboxamide N-[1-[(4-chlorophenyl)methyl]-5-methylpyrazol-3-yl]-5-propan-2-yl-1,2-oxazole-3-carboxamide cid_9550634
Type:
Small organic molecule
Emp. Form.:
C18H19ClN4O2
Mol. Mass.:
358.822
SMILES:
CC(C)c1cc(no1)C(=O)Nc1cc(C)n(Cc2ccc(Cl)cc2)n1
: