Target
Tyrosine-protein phosphatase non-receptor type 7
Ligand
BDBM44530
Substrate
Meas. Tech.
Fluorescent secondary assay for dose-response confirmation of chemical inhibitors of HePTP
IC50
>50000±n/a nM
Citation
 PubChem, PC Fluorescent secondary assay for dose-response confirmation of chemical inhibitors of HePTP PubChem Bioassay (2009)[AID] 
Target
Name:
Tyrosine-protein phosphatase non-receptor type 7
Synonyms:
He-PTP Hematopoietic protein-tyrosine phosphatase (HEPTP) PTPN7 Tyrosine-protein phosphatase non-receptor type 7 | Tyrosine-protein phosphatase non-receptor type 7 (HEPTP)
Type:
Protein
Mol. Mass.:
40530.79
Organism:
Homo sapiens (Human)
Description:
P35236
Residue:
360
  
Inhibitor
Name:
BDBM44530
Synonyms:
3-keto-7-phenyl-5-(2-thienyl)-2-(3,4,5-trimethoxybenzylidene)-5H-thiazolo[3,2-a]pyrimidine-6-carboxylic acid ethyl ester MLS000572607 cid_2885102 ethyl 3-oxo-7-phenyl-5-(2-thienyl)-2-(3,4,5-trimethoxybenzylidene)-2,3-dihydro-5H-[1,3]thiazolo[3,2-a]pyrimidine-6-carboxylate | ethyl 3-oxo-7-phenyl-5-thiophen-2-yl-2-[(3,4,5-trimethoxyphenyl)methylidene]-5H-[1,3]thiazolo[3,2-a]pyrimidine-6-carboxylate
Type:
Small organic molecule
Emp. Form.:
C29H26N2O6S2
Mol. Mass.:
562.657
SMILES:
CCOC(=O)C1=C(N=c2sc(=Cc3cc(OC)c(OC)c(OC)c3)c(=O)n2C1c1cccs1)c1ccccc1
: