Target
Nuclear receptor coactivator 2
Ligand
BDBM34265
Substrate
Meas. Tech.
Dose response biochemical High Throughput Screening assay for agonists of the steroid receptor coactivator 2 (SRC-2) recruitment by the peroxisome proliferator-activated receptor gamma (PPARgamma)
EC50
21930±n/a nM
Citation
 PubChem, PC Dose response biochemical High Throughput Screening assay for agonists of the steroid receptor coactivator 2 (SRC-2) recruitment by the peroxisome proliferator-activated receptor gamma (PPARgamma) PubChem Bioassay (2008)[AID] 
Target
Name:
Nuclear receptor coactivator 2
Synonyms:
BHLHE75 NCOA2 protein SRC2 | TIF2
Type:
Enzyme Catalytic Domain
Mol. Mass.:
159156.93
Organism:
Homo sapiens (Human)
Description:
Q15596
Residue:
1464
  
Inhibitor
Name:
BDBM34265
Synonyms:
2-[6-amino-4-(4-chlorophenyl)-3,5-dicyanopyridin-2-yl]sulfanyl-N-cyclohexylacetamide 2-[[6-amino-4-(4-chlorophenyl)-3,5-dicyano-2-pyridinyl]thio]-N-cyclohexylacetamide MLS000081017 cid_663432
Type:
Small organic molecule
Emp. Form.:
C21H20ClN5OS
Mol. Mass.:
425.934
SMILES:
Nc1nc(SCC(=O)NC2CCCCC2)c(C#N)c(-c2ccc(Cl)cc2)c1C#N
: