Target
Nuclear receptor coactivator 2
Ligand
BDBM42906
Substrate
Meas. Tech.
Dose response biochemical High Throughput Screening assay for agonists of the steroid receptor coactivator 2 (SRC-2) recruitment by the peroxisome proliferator-activated receptor gamma (PPARgamma)
EC50
9311±n/a nM
Citation
 PubChem, PC Dose response biochemical High Throughput Screening assay for agonists of the steroid receptor coactivator 2 (SRC-2) recruitment by the peroxisome proliferator-activated receptor gamma (PPARgamma) PubChem Bioassay (2008)[AID] 
Target
Name:
Nuclear receptor coactivator 2
Synonyms:
BHLHE75 NCOA2 protein SRC2 | TIF2
Type:
Enzyme Catalytic Domain
Mol. Mass.:
159156.93
Organism:
Homo sapiens (Human)
Description:
Q15596
Residue:
1464
  
Inhibitor
Name:
BDBM42906
Synonyms:
MLS000041586 N-(4-fluorophenyl)-2-[(2-methyl-[1]benzofuro[3,2-d]pyrimidin-4-yl)sulfanyl]acetamide N-(4-fluorophenyl)-2-[(2-methylbenzofuro[3,2-d]pyrimidin-4-yl)thio]acetamide cid_664933
Type:
Small organic molecule
Emp. Form.:
C19H14FN3O2S
Mol. Mass.:
367.397
SMILES:
Cc1nc(SCC(=O)Nc2ccc(F)cc2)c2oc3ccccc3c2n1
: