Target
Nuclear receptor coactivator 2
Ligand
BDBM42923
Substrate
Meas. Tech.
Dose response biochemical High Throughput Screening assay for agonists of the steroid receptor coactivator 2 (SRC-2) recruitment by the peroxisome proliferator-activated receptor gamma (PPARgamma)
EC50
14500±n/a nM
Citation
 PubChem, PC Dose response biochemical High Throughput Screening assay for agonists of the steroid receptor coactivator 2 (SRC-2) recruitment by the peroxisome proliferator-activated receptor gamma (PPARgamma) PubChem Bioassay (2008)[AID] 
Target
Name:
Nuclear receptor coactivator 2
Synonyms:
BHLHE75 NCOA2 protein SRC2 | TIF2
Type:
Enzyme Catalytic Domain
Mol. Mass.:
159156.93
Organism:
Homo sapiens (Human)
Description:
Q15596
Residue:
1464
  
Inhibitor
Name:
BDBM42923
Synonyms:
2-(1,3-benzoxazol-2-ylsulfanyl)-1-(3,4,5-trimethoxyphenyl)ethanone MLS000082210 cid_2365424
Type:
Small organic molecule
Emp. Form.:
C18H17NO5S
Mol. Mass.:
359.396
SMILES:
COc1cc(cc(OC)c1OC)C(=O)CSc1nc2ccccc2o1
: