Target
Nuclear receptor coactivator 2
Ligand
BDBM42927
Substrate
Meas. Tech.
Dose response biochemical High Throughput Screening assay for agonists of the steroid receptor coactivator 2 (SRC-2) recruitment by the peroxisome proliferator-activated receptor gamma (PPARgamma)
EC50
10510±n/a nM
Citation
 PubChem, PC Dose response biochemical High Throughput Screening assay for agonists of the steroid receptor coactivator 2 (SRC-2) recruitment by the peroxisome proliferator-activated receptor gamma (PPARgamma) PubChem Bioassay (2008)[AID] 
Target
Name:
Nuclear receptor coactivator 2
Synonyms:
BHLHE75 NCOA2 protein SRC2 | TIF2
Type:
Enzyme Catalytic Domain
Mol. Mass.:
159156.93
Organism:
Homo sapiens (Human)
Description:
Q15596
Residue:
1464
  
Inhibitor
Name:
BDBM42927
Synonyms:
2-[(3-methoxyphenyl)-oxomethyl]imino-3,4-dimethyl-5-thiazolecarboxylic acid ethyl ester MLS000087872 cid_3236505 ethyl 2-(3-methoxybenzoyl)imino-3,4-dimethyl-1,3-thiazole-5-carboxylate | ethyl 2-(3-methoxyphenyl)carbonylimino-3,4-dimethyl-1,3-thiazole-5-carboxylate
Type:
Small organic molecule
Emp. Form.:
C16H18N2O4S
Mol. Mass.:
334.39
SMILES:
CCOC(=O)c1s\c(=N\C(=O)c2cccc(OC)c2)n(C)c1C
: