Target
Nuclear receptor coactivator 2
Ligand
BDBM42932
Substrate
Meas. Tech.
Dose response biochemical High Throughput Screening assay for agonists of the steroid receptor coactivator 2 (SRC-2) recruitment by the peroxisome proliferator-activated receptor gamma (PPARgamma)
EC50
12240±n/a nM
Citation
 PubChem, PC Dose response biochemical High Throughput Screening assay for agonists of the steroid receptor coactivator 2 (SRC-2) recruitment by the peroxisome proliferator-activated receptor gamma (PPARgamma) PubChem Bioassay (2008)[AID] 
Target
Name:
Nuclear receptor coactivator 2
Synonyms:
BHLHE75 NCOA2 protein SRC2 | TIF2
Type:
Enzyme Catalytic Domain
Mol. Mass.:
159156.93
Organism:
Homo sapiens (Human)
Description:
Q15596
Residue:
1464
  
Inhibitor
Name:
BDBM42932
Synonyms:
2-[(3,4-dimethoxyphenyl)-oxomethyl]imino-3,4-dimethyl-5-thiazolecarboxylic acid ethyl ester MLS000087874 cid_3240209 ethyl 2-(3,4-dimethoxybenzoyl)imino-3,4-dimethyl-1,3-thiazole-5-carboxylate | ethyl 2-(3,4-dimethoxyphenyl)carbonylimino-3,4-dimethyl-1,3-thiazole-5-carboxylate
Type:
Small organic molecule
Emp. Form.:
C17H20N2O5S
Mol. Mass.:
364.416
SMILES:
CCOC(=O)c1s\c(=N\C(=O)c2ccc(OC)c(OC)c2)n(C)c1C
: