Target
Nuclear receptor coactivator 2
Ligand
BDBM50303385
Substrate
Meas. Tech.
Dose response biochemical High Throughput Screening assay for agonists of the steroid receptor coactivator 2 (SRC-2) recruitment by the peroxisome proliferator-activated receptor gamma (PPARgamma)
EC50
14620±n/a nM
Citation
 PubChem, PC Dose response biochemical High Throughput Screening assay for agonists of the steroid receptor coactivator 2 (SRC-2) recruitment by the peroxisome proliferator-activated receptor gamma (PPARgamma) PubChem Bioassay (2008)[AID] 
Target
Name:
Nuclear receptor coactivator 2
Synonyms:
BHLHE75 NCOA2 protein SRC2 | TIF2
Type:
Enzyme Catalytic Domain
Mol. Mass.:
159156.93
Organism:
Homo sapiens (Human)
Description:
Q15596
Residue:
1464
  
Inhibitor
Name:
BDBM50303385
Synonyms:
CHEMBL566064 cid_1161245
Type:
Small organic molecule
Emp. Form.:
C20H21N3O3S3
Mol. Mass.:
447.594
SMILES:
O=C(Nc1nc(cs1)-c1ccc(cc1)S(=O)(=O)N1CCCCCC1)c1cccs1
: