Target
Nuclear receptor coactivator 2
Ligand
BDBM42982
Substrate
Meas. Tech.
Dose response biochemical High Throughput Screening assay for agonists of the steroid receptor coactivator 2 (SRC-2) recruitment by the peroxisome proliferator-activated receptor gamma (PPARgamma)
EC50
10230±n/a nM
Citation
 PubChem, PC Dose response biochemical High Throughput Screening assay for agonists of the steroid receptor coactivator 2 (SRC-2) recruitment by the peroxisome proliferator-activated receptor gamma (PPARgamma) PubChem Bioassay (2008)[AID] 
Target
Name:
Nuclear receptor coactivator 2
Synonyms:
BHLHE75 NCOA2 protein SRC2 | TIF2
Type:
Enzyme Catalytic Domain
Mol. Mass.:
159156.93
Organism:
Homo sapiens (Human)
Description:
Q15596
Residue:
1464
  
Inhibitor
Name:
BDBM42982
Synonyms:
(7-Cyano-[1,3]dioxolo[4,5-g]quinolin-6-ylsulfanyl)-acetic acid isopropyl ester 2-[(7-cyano-[1,3]dioxolo[4,5-g]quinolin-6-yl)thio]acetic acid propan-2-yl ester SMR000119314 propan-2-yl 2-[(7-cyano-[1,3]dioxolo[4,5-g]quinolin-6-yl)sulfanyl]acetate | propan-2-yl 2-[(7-cyano-[1,3]dioxolo[4,5-g]quinolin-6-yl)sulfanyl]ethanoate
Type:
Small organic molecule
Emp. Form.:
C16H14N2O4S
Mol. Mass.:
330.358
SMILES:
CC(C)OC(=O)CSc1nc2cc3OCOc3cc2cc1C#N
: