Target
Nuclear receptor coactivator 2
Ligand
BDBM42995
Substrate
Meas. Tech.
Dose response biochemical High Throughput Screening assay for agonists of the steroid receptor coactivator 2 (SRC-2) recruitment by the peroxisome proliferator-activated receptor gamma (PPARgamma)
EC50
2473±n/a nM
Citation
 PubChem, PC Dose response biochemical High Throughput Screening assay for agonists of the steroid receptor coactivator 2 (SRC-2) recruitment by the peroxisome proliferator-activated receptor gamma (PPARgamma) PubChem Bioassay (2008)[AID] 
Target
Name:
Nuclear receptor coactivator 2
Synonyms:
BHLHE75 NCOA2 protein SRC2 | TIF2
Type:
Enzyme Catalytic Domain
Mol. Mass.:
159156.93
Organism:
Homo sapiens (Human)
Description:
Q15596
Residue:
1464
  
Inhibitor
Name:
BDBM42995
Synonyms:
2-(2-Adamantan-1-yl-2-oxo-ethylsulfanyl)-6-amino-4-(4-chloro-phenyl)-pyridine-3,5-dicarbonitrile 2-[2-(1-adamantyl)-2-oxoethyl]sulfanyl-6-amino-4-(4-chlorophenyl)pyridine-3,5-dicarbonitrile 2-[[2-(1-adamantyl)-2-oxoethyl]thio]-6-amino-4-(4-chlorophenyl)pyridine-3,5-dicarbonitrile SMR000146155 | cid_3767937
Type:
Small organic molecule
Emp. Form.:
C25H23ClN4OS
Mol. Mass.:
462.994
SMILES:
[H]C12CC3([H])CC([H])(C1)CC(C2)(C3)C(=O)CSc1nc(N)c(C#N)c(-c2ccc(Cl)cc2)c1C#N
: