Target
Nuclear receptor coactivator 2
Ligand
BDBM42997
Substrate
Meas. Tech.
Dose response biochemical High Throughput Screening assay for agonists of the steroid receptor coactivator 2 (SRC-2) recruitment by the peroxisome proliferator-activated receptor gamma (PPARgamma)
EC50
18600±n/a nM
Citation
 PubChem, PC Dose response biochemical High Throughput Screening assay for agonists of the steroid receptor coactivator 2 (SRC-2) recruitment by the peroxisome proliferator-activated receptor gamma (PPARgamma) PubChem Bioassay (2008)[AID] 
Target
Name:
Nuclear receptor coactivator 2
Synonyms:
BHLHE75 NCOA2 protein SRC2 | TIF2
Type:
Enzyme Catalytic Domain
Mol. Mass.:
159156.93
Organism:
Homo sapiens (Human)
Description:
Q15596
Residue:
1464
  
Inhibitor
Name:
BDBM42997
Synonyms:
8-Benzylsulfanyl-5-morpholin-4-yl-1,2,3,4-tetrahydro-7-thia-6,9,11-triaza-benzo[c]fluorene SMR000145893 | cid_3724031
Type:
Small organic molecule
Emp. Form.:
C24H24N4OS2
Mol. Mass.:
448.604
SMILES:
C(Sc1ncnc2c1sc1nc(N3CCOCC3)c3CCCCc3c21)c1ccccc1
: