Target
Nuclear receptor coactivator 2
Ligand
BDBM43007
Substrate
Meas. Tech.
Dose response biochemical High Throughput Screening assay for agonists of the steroid receptor coactivator 2 (SRC-2) recruitment by the peroxisome proliferator-activated receptor gamma (PPARgamma)
EC50
12850±n/a nM
Citation
 PubChem, PC Dose response biochemical High Throughput Screening assay for agonists of the steroid receptor coactivator 2 (SRC-2) recruitment by the peroxisome proliferator-activated receptor gamma (PPARgamma) PubChem Bioassay (2008)[AID] 
Target
Name:
Nuclear receptor coactivator 2
Synonyms:
BHLHE75 NCOA2 protein SRC2 | TIF2
Type:
Enzyme Catalytic Domain
Mol. Mass.:
159156.93
Organism:
Homo sapiens (Human)
Description:
Q15596
Residue:
1464
  
Inhibitor
Name:
BDBM43007
Synonyms:
5-chloranyl-N-(4-methoxy-3-prop-2-ynyl-1,3-benzothiazol-2-ylidene)thiophene-2-carboxamide 5-chloro-N-(4-methoxy-3-prop-2-ynyl-1,3-benzothiazol-2-ylidene)thiophene-2-carboxamide MLS000530135 cid_2151362
Type:
Small organic molecule
Emp. Form.:
C16H11ClN2O2S2
Mol. Mass.:
362.854
SMILES:
COc1cccc2s\c(=N/C(=O)c3ccc(Cl)s3)n(CC#C)c12
: