Target
Nuclear receptor coactivator 2
Ligand
BDBM43010
Substrate
Meas. Tech.
Dose response biochemical High Throughput Screening assay for agonists of the steroid receptor coactivator 2 (SRC-2) recruitment by the peroxisome proliferator-activated receptor gamma (PPARgamma)
EC50
8217±n/a nM
Citation
 PubChem, PC Dose response biochemical High Throughput Screening assay for agonists of the steroid receptor coactivator 2 (SRC-2) recruitment by the peroxisome proliferator-activated receptor gamma (PPARgamma) PubChem Bioassay (2008)[AID] 
Target
Name:
Nuclear receptor coactivator 2
Synonyms:
BHLHE75 NCOA2 protein SRC2 | TIF2
Type:
Enzyme Catalytic Domain
Mol. Mass.:
159156.93
Organism:
Homo sapiens (Human)
Description:
Q15596
Residue:
1464
  
Inhibitor
Name:
BDBM43010
Synonyms:
2-[3-Cyano-6-(4-methoxy-phenyl)-4-thiophen-2-yl-pyridin-2-ylsulfanyl]-N-(2-methoxy-benzyl)-acetamide 2-[3-cyano-6-(4-methoxyphenyl)-4-thiophen-2-ylpyridin-2-yl]sulfanyl-N-[(2-methoxyphenyl)methyl]acetamide 2-[[3-cyano-6-(4-methoxyphenyl)-4-thiophen-2-yl-2-pyridinyl]thio]-N-[(2-methoxyphenyl)methyl]acetamide SMR000147488 | cid_1004498
Type:
Small organic molecule
Emp. Form.:
C27H23N3O3S2
Mol. Mass.:
501.62
SMILES:
COc1ccc(cc1)-c1cc(-c2cccs2)c(C#N)c(SCC(=O)NCc2ccccc2OC)n1
: