Target
Nuclear receptor coactivator 2
Ligand
BDBM43015
Substrate
Meas. Tech.
Dose response biochemical High Throughput Screening assay for agonists of the steroid receptor coactivator 2 (SRC-2) recruitment by the peroxisome proliferator-activated receptor gamma (PPARgamma)
EC50
21180±n/a nM
Citation
 PubChem, PC Dose response biochemical High Throughput Screening assay for agonists of the steroid receptor coactivator 2 (SRC-2) recruitment by the peroxisome proliferator-activated receptor gamma (PPARgamma) PubChem Bioassay (2008)[AID] 
Target
Name:
Nuclear receptor coactivator 2
Synonyms:
BHLHE75 NCOA2 protein SRC2 | TIF2
Type:
Enzyme Catalytic Domain
Mol. Mass.:
159156.93
Organism:
Homo sapiens (Human)
Description:
Q15596
Residue:
1464
  
Inhibitor
Name:
BDBM43015
Synonyms:
2-Ethoxy-6-phenyl-3-(5-thiophen-2-yl-[1,2,4]oxadiazol-3-yl)-pyridine 3-(2-ethoxy-6-phenyl-3-pyridyl)-5-(2-thienyl)-1,2,4-oxadiazole 3-(2-ethoxy-6-phenylpyridin-3-yl)-5-thiophen-2-yl-1,2,4-oxadiazole SMR000148781 | cid_852900
Type:
Small organic molecule
Emp. Form.:
C19H15N3O2S
Mol. Mass.:
349.406
SMILES:
CCOc1nc(ccc1-c1noc(n1)-c1cccs1)-c1ccccc1
: