Target
Nuclear receptor coactivator 2
Ligand
BDBM43018
Substrate
Meas. Tech.
Dose response biochemical High Throughput Screening assay for agonists of the steroid receptor coactivator 2 (SRC-2) recruitment by the peroxisome proliferator-activated receptor gamma (PPARgamma)
EC50
9785±n/a nM
Citation
 PubChem, PC Dose response biochemical High Throughput Screening assay for agonists of the steroid receptor coactivator 2 (SRC-2) recruitment by the peroxisome proliferator-activated receptor gamma (PPARgamma) PubChem Bioassay (2008)[AID] 
Target
Name:
Nuclear receptor coactivator 2
Synonyms:
BHLHE75 NCOA2 protein SRC2 | TIF2
Type:
Enzyme Catalytic Domain
Mol. Mass.:
159156.93
Organism:
Homo sapiens (Human)
Description:
Q15596
Residue:
1464
  
Inhibitor
Name:
BDBM43018
Synonyms:
4-bromanyl-N-(1-propylbenzimidazol-2-yl)benzamide 4-bromo-N-(1-propylbenzimidazol-2-yl)benzamide SMR000152119 | cid_5233279
Type:
Small organic molecule
Emp. Form.:
C17H16BrN3O
Mol. Mass.:
358.232
SMILES:
CCCn1c(NC(=O)c2ccc(Br)cc2)nc2ccccc12
: