Target
Nuclear receptor coactivator 2
Ligand
BDBM43021
Substrate
Meas. Tech.
Dose response biochemical High Throughput Screening assay for agonists of the steroid receptor coactivator 2 (SRC-2) recruitment by the peroxisome proliferator-activated receptor gamma (PPARgamma)
EC50
<8818±n/a nM
Citation
 PubChem, PC Dose response biochemical High Throughput Screening assay for agonists of the steroid receptor coactivator 2 (SRC-2) recruitment by the peroxisome proliferator-activated receptor gamma (PPARgamma) PubChem Bioassay (2008)[AID] 
Target
Name:
Nuclear receptor coactivator 2
Synonyms:
BHLHE75 NCOA2 protein SRC2 | TIF2
Type:
Enzyme Catalytic Domain
Mol. Mass.:
159156.93
Organism:
Homo sapiens (Human)
Description:
Q15596
Residue:
1464
  
Inhibitor
Name:
BDBM43021
Synonyms:
3-[(5-bromothiophene-2-carbonyl)amino]thiophene-2-carboxylic acid methyl ester MLS000538431 cid_1246013 methyl 3-[(5-bromothiophene-2-carbonyl)amino]thiophene-2-carboxylate | methyl 3-{[(5-bromo-2-thienyl)carbonyl]amino}-2-thiophenecarboxylate
Type:
Small organic molecule
Emp. Form.:
C11H8BrNO3S2
Mol. Mass.:
346.22
SMILES:
COC(=O)c1sccc1NC(=O)c1ccc(Br)s1
: