Target
Nuclear receptor coactivator 2
Ligand
BDBM43023
Substrate
Meas. Tech.
Dose response biochemical High Throughput Screening assay for agonists of the steroid receptor coactivator 2 (SRC-2) recruitment by the peroxisome proliferator-activated receptor gamma (PPARgamma)
EC50
14540±n/a nM
Citation
 PubChem, PC Dose response biochemical High Throughput Screening assay for agonists of the steroid receptor coactivator 2 (SRC-2) recruitment by the peroxisome proliferator-activated receptor gamma (PPARgamma) PubChem Bioassay (2008)[AID] 
Target
Name:
Nuclear receptor coactivator 2
Synonyms:
BHLHE75 NCOA2 protein SRC2 | TIF2
Type:
Enzyme Catalytic Domain
Mol. Mass.:
159156.93
Organism:
Homo sapiens (Human)
Description:
Q15596
Residue:
1464
  
Inhibitor
Name:
BDBM43023
Synonyms:
2-[[5-(1-benzofuran-2-yl)-4-methyl-1,2,4-triazol-3-yl]sulfanyl]-N-(3-bromophenyl)acetamide 2-[[5-(2-benzofuranyl)-4-methyl-1,2,4-triazol-3-yl]thio]-N-(3-bromophenyl)acetamide 2-{[5-(1-benzofuran-2-yl)-4-methyl-4H-1,2,4-triazol-3-yl]thio}-N-(3-bromophenyl)acetamide SMR000143743 | cid_1262634
Type:
Small organic molecule
Emp. Form.:
C19H15BrN4O2S
Mol. Mass.:
443.317
SMILES:
Cn1c(SCC(=O)Nc2cccc(Br)c2)nnc1-c1cc2ccccc2o1
: