Target
Nuclear receptor coactivator 2
Ligand
BDBM43028
Substrate
Meas. Tech.
Dose response biochemical High Throughput Screening assay for agonists of the steroid receptor coactivator 2 (SRC-2) recruitment by the peroxisome proliferator-activated receptor gamma (PPARgamma)
EC50
9891±n/a nM
Citation
 PubChem, PC Dose response biochemical High Throughput Screening assay for agonists of the steroid receptor coactivator 2 (SRC-2) recruitment by the peroxisome proliferator-activated receptor gamma (PPARgamma) PubChem Bioassay (2008)[AID] 
Target
Name:
Nuclear receptor coactivator 2
Synonyms:
BHLHE75 NCOA2 protein SRC2 | TIF2
Type:
Enzyme Catalytic Domain
Mol. Mass.:
159156.93
Organism:
Homo sapiens (Human)
Description:
Q15596
Residue:
1464
  
Inhibitor
Name:
BDBM43028
Synonyms:
2-({5-[2-(4-bromophenyl)-2-oxoethyl]-3-cyano-4,6-dimethyl-2-pyridinyl}sulfanyl)-N-(4-fluorophenyl)acetamide 2-[5-[2-(4-bromophenyl)-2-oxoethyl]-3-cyano-4,6-dimethylpyridin-2-yl]sulfanyl-N-(4-fluorophenyl)acetamide 2-[[5-[2-(4-bromophenyl)-2-oxoethyl]-3-cyano-4,6-dimethyl-2-pyridinyl]thio]-N-(4-fluorophenyl)acetamide SMR000161056 | cid_1025062
Type:
Small organic molecule
Emp. Form.:
C24H19BrFN3O2S
Mol. Mass.:
512.394
SMILES:
Cc1nc(SCC(=O)Nc2ccc(F)cc2)c(C#N)c(C)c1CC(=O)c1ccc(Br)cc1
: