Target
Nuclear receptor coactivator 2
Ligand
BDBM41052
Substrate
Meas. Tech.
Dose response biochemical High Throughput Screening assay for agonists of the steroid receptor coactivator 2 (SRC-2) recruitment by the peroxisome proliferator-activated receptor gamma (PPARgamma)
EC50
19160±n/a nM
Citation
 PubChem, PC Dose response biochemical High Throughput Screening assay for agonists of the steroid receptor coactivator 2 (SRC-2) recruitment by the peroxisome proliferator-activated receptor gamma (PPARgamma) PubChem Bioassay (2008)[AID] 
Target
Name:
Nuclear receptor coactivator 2
Synonyms:
BHLHE75 NCOA2 protein SRC2 | TIF2
Type:
Enzyme Catalytic Domain
Mol. Mass.:
159156.93
Organism:
Homo sapiens (Human)
Description:
Q15596
Residue:
1464
  
Inhibitor
Name:
BDBM41052
Synonyms:
3-(3-chloranyl-4-methoxy-phenyl)-4-oxidanylidene-N-[2-oxidanylidene-2-(pyridin-2-ylamino)ethyl]phthalazine-1-carboxamide 3-(3-chloro-4-methoxyphenyl)-4-oxo-N-[2-oxo-2-(2-pyridinylamino)ethyl]-1-phthalazinecarboxamide MLS000519682 cid_11957249
Type:
Small organic molecule
Emp. Form.:
C23H18ClN5O4
Mol. Mass.:
463.873
SMILES:
COc1ccc(cc1Cl)-n1nc(C(=O)NCC(=O)Nc2ccccn2)c2ccccc2c1=O
: