Target
Nuclear receptor coactivator 2
Ligand
BDBM43037
Substrate
Meas. Tech.
Dose response biochemical High Throughput Screening assay for agonists of the steroid receptor coactivator 2 (SRC-2) recruitment by the peroxisome proliferator-activated receptor gamma (PPARgamma)
EC50
20130±n/a nM
Citation
 PubChem, PC Dose response biochemical High Throughput Screening assay for agonists of the steroid receptor coactivator 2 (SRC-2) recruitment by the peroxisome proliferator-activated receptor gamma (PPARgamma) PubChem Bioassay (2008)[AID] 
Target
Name:
Nuclear receptor coactivator 2
Synonyms:
BHLHE75 NCOA2 protein SRC2 | TIF2
Type:
Enzyme Catalytic Domain
Mol. Mass.:
159156.93
Organism:
Homo sapiens (Human)
Description:
Q15596
Residue:
1464
  
Inhibitor
Name:
BDBM43037
Synonyms:
3,6-bis(chloranyl)-1-[2-[[3-chloranyl-5-(trifluoromethyl)pyridin-2-yl]amino]ethyl]quinoxalin-2-one 3,6-dichloro-1-[2-[[3-chloro-5-(trifluoromethyl)-2-pyridinyl]amino]ethyl]-2-quinoxalinone 3,6-dichloro-1-[2-[[3-chloro-5-(trifluoromethyl)pyridin-2-yl]amino]ethyl]quinoxalin-2-one SMR000170129 | cid_1471937
Type:
Small organic molecule
Emp. Form.:
C16H10Cl3F3N4O
Mol. Mass.:
437.631
SMILES:
FC(F)(F)c1cnc(NCCn2c3ccc(Cl)cc3nc(Cl)c2=O)c(Cl)c1
: