Target
Nuclear receptor coactivator 2
Ligand
BDBM43042
Substrate
Meas. Tech.
Dose response biochemical High Throughput Screening assay for agonists of the steroid receptor coactivator 2 (SRC-2) recruitment by the peroxisome proliferator-activated receptor gamma (PPARgamma)
EC50
13660±n/a nM
Citation
 PubChem, PC Dose response biochemical High Throughput Screening assay for agonists of the steroid receptor coactivator 2 (SRC-2) recruitment by the peroxisome proliferator-activated receptor gamma (PPARgamma) PubChem Bioassay (2008)[AID] 
Target
Name:
Nuclear receptor coactivator 2
Synonyms:
BHLHE75 NCOA2 protein SRC2 | TIF2
Type:
Enzyme Catalytic Domain
Mol. Mass.:
159156.93
Organism:
Homo sapiens (Human)
Description:
Q15596
Residue:
1464
  
Inhibitor
Name:
BDBM43042
Synonyms:
2-[2-oxidanylidene-2-(2-oxidanylidenechromen-3-yl)ethyl]sulfanyl-6-phenyl-pyridine-3-carbonitrile 2-[[2-keto-2-(2-ketochromen-3-yl)ethyl]thio]-6-phenyl-nicotinonitrile 2-{[2-oxo-2-(2-oxo-2H-chromen-3-yl)ethyl]sulfanyl}-6-phenylnicotinonitrile SMR000162928 | cid_979025
Type:
Small organic molecule
Emp. Form.:
C23H14N2O3S
Mol. Mass.:
398.434
SMILES:
O=C(CSc1nc(ccc1C#N)-c1ccccc1)c1cc2ccccc2oc1=O
: