Target
Nuclear receptor coactivator 2
Ligand
BDBM43044
Substrate
Meas. Tech.
Dose response biochemical High Throughput Screening assay for agonists of the steroid receptor coactivator 2 (SRC-2) recruitment by the peroxisome proliferator-activated receptor gamma (PPARgamma)
EC50
8895±n/a nM
Citation
 PubChem, PC Dose response biochemical High Throughput Screening assay for agonists of the steroid receptor coactivator 2 (SRC-2) recruitment by the peroxisome proliferator-activated receptor gamma (PPARgamma) PubChem Bioassay (2008)[AID] 
Target
Name:
Nuclear receptor coactivator 2
Synonyms:
BHLHE75 NCOA2 protein SRC2 | TIF2
Type:
Enzyme Catalytic Domain
Mol. Mass.:
159156.93
Organism:
Homo sapiens (Human)
Description:
Q15596
Residue:
1464
  
Inhibitor
Name:
BDBM43044
Synonyms:
3-(4-Chloro-phenyl)-1-cyclopropyl-1-(7-ethyl-1,2,3,9b-tetraaza-cyclopenta[a]naphthalen-4-ylmethyl)-thiourea 3-(4-chlorophenyl)-1-cyclopropyl-1-[(7-ethyl-[1,2,3,4]tetrazolo[1,5-a]quinolin-4-yl)methyl]thiourea MLS000556783 cid_1454926
Type:
Small organic molecule
Emp. Form.:
C22H21ClN6S
Mol. Mass.:
436.96
SMILES:
CCc1ccc2c(c1)cc(CN(C1CC1)C(=S)Nc1ccc(Cl)cc1)c1nnnn21
: