Target
Nuclear receptor coactivator 2
Ligand
BDBM43045
Substrate
Meas. Tech.
Dose response biochemical High Throughput Screening assay for agonists of the steroid receptor coactivator 2 (SRC-2) recruitment by the peroxisome proliferator-activated receptor gamma (PPARgamma)
EC50
12140±n/a nM
Citation
 PubChem, PC Dose response biochemical High Throughput Screening assay for agonists of the steroid receptor coactivator 2 (SRC-2) recruitment by the peroxisome proliferator-activated receptor gamma (PPARgamma) PubChem Bioassay (2008)[AID] 
Target
Name:
Nuclear receptor coactivator 2
Synonyms:
BHLHE75 NCOA2 protein SRC2 | TIF2
Type:
Enzyme Catalytic Domain
Mol. Mass.:
159156.93
Organism:
Homo sapiens (Human)
Description:
Q15596
Residue:
1464
  
Inhibitor
Name:
BDBM43045
Synonyms:
10-methoxy-5H-[1]benzothiolo[2,3-c]quinolin-6-one 10-methoxy[1]benzothieno[2,3-c]quinolin-6(5H)-one SMR000162291 | cid_1779937
Type:
Small organic molecule
Emp. Form.:
C16H11NO2S
Mol. Mass.:
281.329
SMILES:
COc1ccc2sc3c(c2c1)c1ccccc1[nH]c3=O
: