Target
Nuclear receptor coactivator 2
Ligand
BDBM43053
Substrate
Meas. Tech.
Dose response biochemical High Throughput Screening assay for agonists of the steroid receptor coactivator 2 (SRC-2) recruitment by the peroxisome proliferator-activated receptor gamma (PPARgamma)
EC50
21150±n/a nM
Citation
 PubChem, PC Dose response biochemical High Throughput Screening assay for agonists of the steroid receptor coactivator 2 (SRC-2) recruitment by the peroxisome proliferator-activated receptor gamma (PPARgamma) PubChem Bioassay (2008)[AID] 
Target
Name:
Nuclear receptor coactivator 2
Synonyms:
BHLHE75 NCOA2 protein SRC2 | TIF2
Type:
Enzyme Catalytic Domain
Mol. Mass.:
159156.93
Organism:
Homo sapiens (Human)
Description:
Q15596
Residue:
1464
  
Inhibitor
Name:
BDBM43053
Synonyms:
3-(3,5-dichlorophenoxy)-1-methyl-2(1H)-quinoxalinone 3-(3,5-dichlorophenoxy)-1-methyl-quinoxalin-2-one 3-[3,5-bis(chloranyl)phenoxy]-1-methyl-quinoxalin-2-one SMR000169943 | cid_1471093
Type:
Small organic molecule
Emp. Form.:
C15H10Cl2N2O2
Mol. Mass.:
321.158
SMILES:
Cn1c2ccccc2nc(Oc2cc(Cl)cc(Cl)c2)c1=O
: