Target
Nuclear receptor coactivator 2
Ligand
BDBM43054
Substrate
Meas. Tech.
Dose response biochemical High Throughput Screening assay for agonists of the steroid receptor coactivator 2 (SRC-2) recruitment by the peroxisome proliferator-activated receptor gamma (PPARgamma)
EC50
11920±n/a nM
Citation
 PubChem, PC Dose response biochemical High Throughput Screening assay for agonists of the steroid receptor coactivator 2 (SRC-2) recruitment by the peroxisome proliferator-activated receptor gamma (PPARgamma) PubChem Bioassay (2008)[AID] 
Target
Name:
Nuclear receptor coactivator 2
Synonyms:
BHLHE75 NCOA2 protein SRC2 | TIF2
Type:
Enzyme Catalytic Domain
Mol. Mass.:
159156.93
Organism:
Homo sapiens (Human)
Description:
Q15596
Residue:
1464
  
Inhibitor
Name:
BDBM43054
Synonyms:
MLS000543203 [2-(4-chlorophenyl)-1,3-thiazol-5-yl](phenyl)methanone [2-(4-chlorophenyl)-1,3-thiazol-5-yl]-phenylmethanone [2-(4-chlorophenyl)thiazol-5-yl]-phenyl-methanone | cid_3789019
Type:
Small organic molecule
Emp. Form.:
C16H10ClNOS
Mol. Mass.:
299.775
SMILES:
Clc1ccc(cc1)-c1ncc(s1)C(=O)c1ccccc1
: