Target
Nuclear receptor coactivator 2
Ligand
BDBM43055
Substrate
Meas. Tech.
Dose response biochemical High Throughput Screening assay for agonists of the steroid receptor coactivator 2 (SRC-2) recruitment by the peroxisome proliferator-activated receptor gamma (PPARgamma)
EC50
18670±n/a nM
Citation
 PubChem, PC Dose response biochemical High Throughput Screening assay for agonists of the steroid receptor coactivator 2 (SRC-2) recruitment by the peroxisome proliferator-activated receptor gamma (PPARgamma) PubChem Bioassay (2008)[AID] 
Target
Name:
Nuclear receptor coactivator 2
Synonyms:
BHLHE75 NCOA2 protein SRC2 | TIF2
Type:
Enzyme Catalytic Domain
Mol. Mass.:
159156.93
Organism:
Homo sapiens (Human)
Description:
Q15596
Residue:
1464
  
Inhibitor
Name:
BDBM43055
Synonyms:
MLS000543206 [2-(4-chlorophenyl)-1,3-thiazol-5-yl](2,4-dichlorophenyl)methanone [2-(4-chlorophenyl)-5-thiazolyl]-(2,4-dichlorophenyl)methanone cid_3851581
Type:
Small organic molecule
Emp. Form.:
C16H8Cl3NOS
Mol. Mass.:
368.665
SMILES:
Clc1ccc(cc1)-c1ncc(s1)C(=O)c1ccc(Cl)cc1Cl
: