Target
Nuclear receptor coactivator 2
Ligand
BDBM43070
Substrate
Meas. Tech.
Dose response biochemical High Throughput Screening assay for agonists of the steroid receptor coactivator 2 (SRC-2) recruitment by the peroxisome proliferator-activated receptor gamma (PPARgamma)
EC50
5170±n/a nM
Citation
 PubChem, PC Dose response biochemical High Throughput Screening assay for agonists of the steroid receptor coactivator 2 (SRC-2) recruitment by the peroxisome proliferator-activated receptor gamma (PPARgamma) PubChem Bioassay (2008)[AID] 
Target
Name:
Nuclear receptor coactivator 2
Synonyms:
BHLHE75 NCOA2 protein SRC2 | TIF2
Type:
Enzyme Catalytic Domain
Mol. Mass.:
159156.93
Organism:
Homo sapiens (Human)
Description:
Q15596
Residue:
1464
  
Inhibitor
Name:
BDBM43070
Synonyms:
MLS000560834 N'-(2-naphthalen-2-yloxyethanoyl)-2-phenyl-ethanehydrazide N'-[2-(2-naphthoxy)acetyl]-2-phenyl-acetohydrazide SMR000175174 | cid_809243
Type:
Small organic molecule
Emp. Form.:
C20H18N2O3
Mol. Mass.:
334.3685
SMILES:
O=C(COc1ccc2ccccc2c1)NNC(=O)Cc1ccccc1
: