Target
Nuclear receptor coactivator 2
Ligand
BDBM43090
Substrate
Meas. Tech.
Dose response biochemical High Throughput Screening assay for agonists of the steroid receptor coactivator 2 (SRC-2) recruitment by the peroxisome proliferator-activated receptor gamma (PPARgamma)
EC50
13990±n/a nM
Citation
 PubChem, PC Dose response biochemical High Throughput Screening assay for agonists of the steroid receptor coactivator 2 (SRC-2) recruitment by the peroxisome proliferator-activated receptor gamma (PPARgamma) PubChem Bioassay (2008)[AID] 
Target
Name:
Nuclear receptor coactivator 2
Synonyms:
BHLHE75 NCOA2 protein SRC2 | TIF2
Type:
Enzyme Catalytic Domain
Mol. Mass.:
159156.93
Organism:
Homo sapiens (Human)
Description:
Q15596
Residue:
1464
  
Inhibitor
Name:
BDBM43090
Synonyms:
2,5-bis(chloranyl)-N-[3-(2-ethoxyethyl)-6-sulfamoyl-1,3-benzothiazol-2-ylidene]thiophene-3-carboxamide 2,5-dichloro-N-[3-(2-ethoxyethyl)-6-sulfamoyl-1,3-benzothiazol-2-ylidene]thiophene-3-carboxamide SMR000237867 | cid_4142608
Type:
Small organic molecule
Emp. Form.:
C16H15Cl2N3O4S3
Mol. Mass.:
480.409
SMILES:
CCOCCn1c2ccc(cc2s\c1=N/C(=O)c1cc(Cl)sc1Cl)S(N)(=O)=O
: