Target
Nuclear receptor coactivator 2
Ligand
BDBM43097
Substrate
Meas. Tech.
Dose response biochemical High Throughput Screening assay for agonists of the steroid receptor coactivator 2 (SRC-2) recruitment by the peroxisome proliferator-activated receptor gamma (PPARgamma)
EC50
18780±n/a nM
Citation
 PubChem, PC Dose response biochemical High Throughput Screening assay for agonists of the steroid receptor coactivator 2 (SRC-2) recruitment by the peroxisome proliferator-activated receptor gamma (PPARgamma) PubChem Bioassay (2008)[AID] 
Target
Name:
Nuclear receptor coactivator 2
Synonyms:
BHLHE75 NCOA2 protein SRC2 | TIF2
Type:
Enzyme Catalytic Domain
Mol. Mass.:
159156.93
Organism:
Homo sapiens (Human)
Description:
Q15596
Residue:
1464
  
Inhibitor
Name:
BDBM43097
Synonyms:
3-chloro-1-benzothiophene-2-carboxylic acid [2-[(3,5-dichloro-2-pyridinyl)amino]-2-oxoethyl] ester MLS000390240 [2-[(3,5-dichloropyridin-2-yl)amino]-2-oxoethyl] 3-chloro-1-benzothiophene-2-carboxylate cid_2339538
Type:
Small organic molecule
Emp. Form.:
C16H9Cl3N2O3S
Mol. Mass.:
415.678
SMILES:
Clc1c(sc2ccccc12)C(=O)OCC(=O)Nc1ncc(Cl)cc1Cl
: