Target
Nuclear receptor coactivator 2
Ligand
BDBM43104
Substrate
Meas. Tech.
Dose response biochemical High Throughput Screening assay for agonists of the steroid receptor coactivator 2 (SRC-2) recruitment by the peroxisome proliferator-activated receptor gamma (PPARgamma)
EC50
18100±n/a nM
Citation
 PubChem, PC Dose response biochemical High Throughput Screening assay for agonists of the steroid receptor coactivator 2 (SRC-2) recruitment by the peroxisome proliferator-activated receptor gamma (PPARgamma) PubChem Bioassay (2008)[AID] 
Target
Name:
Nuclear receptor coactivator 2
Synonyms:
BHLHE75 NCOA2 protein SRC2 | TIF2
Type:
Enzyme Catalytic Domain
Mol. Mass.:
159156.93
Organism:
Homo sapiens (Human)
Description:
Q15596
Residue:
1464
  
Inhibitor
Name:
BDBM43104
Synonyms:
2-(3-bromophenyl)-4-quinolinecarboxylic acid [2-[3-(dimethylsulfamoyl)anilino]-2-oxoethyl] ester MLS000409164 [2-[3-(dimethylsulfamoyl)anilino]-2-oxoethyl] 2-(3-bromophenyl)quinoline-4-carboxylate cid_4173883
Type:
Small organic molecule
Emp. Form.:
C26H22BrN3O5S
Mol. Mass.:
568.439
SMILES:
CN(C)S(=O)(=O)c1cccc(NC(=O)COC(=O)c2cc(nc3ccccc23)-c2cccc(Br)c2)c1
: