Target
Nuclear receptor coactivator 2
Ligand
BDBM43137
Substrate
Meas. Tech.
Dose response biochemical High Throughput Screening assay for agonists of the steroid receptor coactivator 2 (SRC-2) recruitment by the peroxisome proliferator-activated receptor gamma (PPARgamma)
EC50
16030±n/a nM
Citation
 PubChem, PC Dose response biochemical High Throughput Screening assay for agonists of the steroid receptor coactivator 2 (SRC-2) recruitment by the peroxisome proliferator-activated receptor gamma (PPARgamma) PubChem Bioassay (2008)[AID] 
Target
Name:
Nuclear receptor coactivator 2
Synonyms:
BHLHE75 NCOA2 protein SRC2 | TIF2
Type:
Enzyme Catalytic Domain
Mol. Mass.:
159156.93
Organism:
Homo sapiens (Human)
Description:
Q15596
Residue:
1464
  
Inhibitor
Name:
BDBM43137
Synonyms:
5-bromanyl-N-(phenylcarbamothioyl)furan-2-carboxamide 5-bromo-N-(phenylthiocarbamoyl)-2-furamide N-(anilinocarbonothioyl)-5-bromo-2-furamide SMR000271902 | cid_892808
Type:
Small organic molecule
Emp. Form.:
C12H9BrN2O2S
Mol. Mass.:
325.181
SMILES:
Brc1ccc(o1)C(=O)NC(=S)Nc1ccccc1
: