Target
Nuclear receptor coactivator 2
Ligand
BDBM43176
Substrate
Meas. Tech.
Dose response biochemical High Throughput Screening assay for agonists of the steroid receptor coactivator 2 (SRC-2) recruitment by the peroxisome proliferator-activated receptor gamma (PPARgamma)
EC50
13460±n/a nM
Citation
 PubChem, PC Dose response biochemical High Throughput Screening assay for agonists of the steroid receptor coactivator 2 (SRC-2) recruitment by the peroxisome proliferator-activated receptor gamma (PPARgamma) PubChem Bioassay (2008)[AID] 
Target
Name:
Nuclear receptor coactivator 2
Synonyms:
BHLHE75 NCOA2 protein SRC2 | TIF2
Type:
Enzyme Catalytic Domain
Mol. Mass.:
159156.93
Organism:
Homo sapiens (Human)
Description:
Q15596
Residue:
1464
  
Inhibitor
Name:
BDBM43176
Synonyms:
4-fluoranyl-N-(2-phenylquinazolin-4-yl)benzamide 4-fluoro-N-(2-phenyl-4-quinazolinyl)benzenecarboxamide MLS000755733 cid_4616002
Type:
Small organic molecule
Emp. Form.:
C21H14FN3O
Mol. Mass.:
343.3538
SMILES:
Fc1ccc(cc1)C(=O)Nc1nc(nc2ccccc12)-c1ccccc1
: