Target
Nuclear receptor coactivator 3
Ligand
BDBM43145
Substrate
Meas. Tech.
Dose response biochemical High Throughput Screening assay for agonists of the steroid receptor coactivator 3 (SRC-3) recruitment by the peroxisome proliferator-activated receptor gamma (PPARgamma)
EC50
>79370±n/a nM
Citation
 PubChem, PC Dose response biochemical High Throughput Screening assay for agonists of the steroid receptor coactivator 3 (SRC-3) recruitment by the peroxisome proliferator-activated receptor gamma (PPARgamma) PubChem Bioassay (2008)[AID] 
Target
Name:
Nuclear receptor coactivator 3
Synonyms:
AIB1 NCOA3 RAC3 nuclear receptor coactivator 3 isoform a
Type:
Enzyme Catalytic Domain
Mol. Mass.:
155305.29
Organism:
Homo sapiens (Human)
Description:
Q9Y6Q9
Residue:
1424
  
Inhibitor
Name:
BDBM43145
Synonyms:
MLS000672272 N-[[5-[2-[(3-fluorophenyl)amino]-2-oxidanylidene-ethyl]sulfanyl-4-methyl-1,2,4-triazol-3-yl]methyl]-2-(4-methoxyphenyl)ethanamide N-[[5-[[2-(3-fluoroanilino)-2-oxoethyl]thio]-4-methyl-1,2,4-triazol-3-yl]methyl]-2-(4-methoxyphenyl)acetamide SMR000295507 | cid_2221899
Type:
Small organic molecule
Emp. Form.:
C21H22FN5O3S
Mol. Mass.:
443.494
SMILES:
COc1ccc(CC(=O)NCc2nnc(SCC(=O)Nc3cccc(F)c3)n2C)cc1
: