Target
Nuclear receptor coactivator 3
Ligand
BDBM43146
Substrate
Meas. Tech.
Dose response biochemical High Throughput Screening assay for agonists of the steroid receptor coactivator 3 (SRC-3) recruitment by the peroxisome proliferator-activated receptor gamma (PPARgamma)
EC50
>79370±n/a nM
Citation
 PubChem, PC Dose response biochemical High Throughput Screening assay for agonists of the steroid receptor coactivator 3 (SRC-3) recruitment by the peroxisome proliferator-activated receptor gamma (PPARgamma) PubChem Bioassay (2008)[AID] 
Target
Name:
Nuclear receptor coactivator 3
Synonyms:
AIB1 NCOA3 RAC3 nuclear receptor coactivator 3 isoform a
Type:
Enzyme Catalytic Domain
Mol. Mass.:
155305.29
Organism:
Homo sapiens (Human)
Description:
Q9Y6Q9
Residue:
1424
  
Inhibitor
Name:
BDBM43146
Synonyms:
4-({3-[(4-fluorobenzyl)oxy]benzyl}amino)phenol 4-[[3-[(4-fluorophenyl)methoxy]phenyl]methylamino]phenol SMR000299882 | cid_833986
Type:
Small organic molecule
Emp. Form.:
C20H18FNO2
Mol. Mass.:
323.3608
SMILES:
Oc1ccc(NCc2cccc(OCc3ccc(F)cc3)c2)cc1
: