Target
Nuclear receptor coactivator 3
Ligand
BDBM43147
Substrate
Meas. Tech.
Dose response biochemical High Throughput Screening assay for agonists of the steroid receptor coactivator 3 (SRC-3) recruitment by the peroxisome proliferator-activated receptor gamma (PPARgamma)
EC50
>79370±n/a nM
Citation
 PubChem, PC Dose response biochemical High Throughput Screening assay for agonists of the steroid receptor coactivator 3 (SRC-3) recruitment by the peroxisome proliferator-activated receptor gamma (PPARgamma) PubChem Bioassay (2008)[AID] 
Target
Name:
Nuclear receptor coactivator 3
Synonyms:
AIB1 NCOA3 RAC3 nuclear receptor coactivator 3 isoform a
Type:
Enzyme Catalytic Domain
Mol. Mass.:
155305.29
Organism:
Homo sapiens (Human)
Description:
Q9Y6Q9
Residue:
1424
  
Inhibitor
Name:
BDBM43147
Synonyms:
(E)-2-cyano-3-[5-(4-methyl-2-nitro-phenyl)-2-furyl]thioacrylamide (E)-2-cyano-3-[5-(4-methyl-2-nitrophenyl)-2-furanyl]-2-propenethioamide 2-cyano-3-[5-(4-methyl-2-nitrophenyl)-2-furyl]-2-propenethioamide SMR000293733 | cid_1583581
Type:
Small organic molecule
Emp. Form.:
C15H11N3O3S
Mol. Mass.:
313.331
SMILES:
Cc1ccc(-c2ccc(\C=C(/C#N)C(N)=S)o2)c(c1)[N+]([O-])=O
: