Target
Nuclear receptor coactivator 3
Ligand
BDBM43153
Substrate
Meas. Tech.
Dose response biochemical High Throughput Screening assay for agonists of the steroid receptor coactivator 3 (SRC-3) recruitment by the peroxisome proliferator-activated receptor gamma (PPARgamma)
EC50
>79370±n/a nM
Citation
 PubChem, PC Dose response biochemical High Throughput Screening assay for agonists of the steroid receptor coactivator 3 (SRC-3) recruitment by the peroxisome proliferator-activated receptor gamma (PPARgamma) PubChem Bioassay (2008)[AID] 
Target
Name:
Nuclear receptor coactivator 3
Synonyms:
AIB1 NCOA3 RAC3 nuclear receptor coactivator 3 isoform a
Type:
Enzyme Catalytic Domain
Mol. Mass.:
155305.29
Organism:
Homo sapiens (Human)
Description:
Q9Y6Q9
Residue:
1424
  
Inhibitor
Name:
BDBM43153
Synonyms:
1-[3-(2-methylbenzyl)-3-methylol-piperidino]-4-phenyl-butane-1,4-dione 1-[3-(hydroxymethyl)-3-[(2-methylphenyl)methyl]piperidin-1-yl]-4-phenyl-butane-1,4-dione 4-[3-(hydroxymethyl)-3-(2-methylbenzyl)piperidin-1-yl]-4-oxo-1-phenylbutan-1-one SMR000317644 | cid_16191010
Type:
Small organic molecule
Emp. Form.:
C24H29NO3
Mol. Mass.:
379.492
SMILES:
Cc1ccccc1CC1(CO)CCCN(C1)C(=O)CCC(=O)c1ccccc1
: