Target
Nuclear receptor coactivator 3
Ligand
BDBM43156
Substrate
Meas. Tech.
Dose response biochemical High Throughput Screening assay for agonists of the steroid receptor coactivator 3 (SRC-3) recruitment by the peroxisome proliferator-activated receptor gamma (PPARgamma)
EC50
>79370±n/a nM
Citation
 PubChem, PC Dose response biochemical High Throughput Screening assay for agonists of the steroid receptor coactivator 3 (SRC-3) recruitment by the peroxisome proliferator-activated receptor gamma (PPARgamma) PubChem Bioassay (2008)[AID] 
Target
Name:
Nuclear receptor coactivator 3
Synonyms:
AIB1 NCOA3 RAC3 nuclear receptor coactivator 3 isoform a
Type:
Enzyme Catalytic Domain
Mol. Mass.:
155305.29
Organism:
Homo sapiens (Human)
Description:
Q9Y6Q9
Residue:
1424
  
Inhibitor
Name:
BDBM43156
Synonyms:
MLS000713954 N-(2,3-dimethylphenyl)-N-[2-[4-(4-fluorophenyl)piperazin-1-yl]-2-oxidanylidene-ethyl]methanesulfonamide N-(2,3-dimethylphenyl)-N-[2-[4-(4-fluorophenyl)piperazino]-2-keto-ethyl]methanesulfonamide cid_1163680
Type:
Small organic molecule
Emp. Form.:
C21H26FN3O3S
Mol. Mass.:
419.513
SMILES:
Cc1cccc(N(CC(=O)N2CCN(CC2)c2ccc(F)cc2)S(C)(=O)=O)c1C
: