Target
Nuclear receptor coactivator 3
Ligand
BDBM43159
Substrate
Meas. Tech.
Dose response biochemical High Throughput Screening assay for agonists of the steroid receptor coactivator 3 (SRC-3) recruitment by the peroxisome proliferator-activated receptor gamma (PPARgamma)
EC50
>79370±n/a nM
Citation
 PubChem, PC Dose response biochemical High Throughput Screening assay for agonists of the steroid receptor coactivator 3 (SRC-3) recruitment by the peroxisome proliferator-activated receptor gamma (PPARgamma) PubChem Bioassay (2008)[AID] 
Target
Name:
Nuclear receptor coactivator 3
Synonyms:
AIB1 NCOA3 RAC3 nuclear receptor coactivator 3 isoform a
Type:
Enzyme Catalytic Domain
Mol. Mass.:
155305.29
Organism:
Homo sapiens (Human)
Description:
Q9Y6Q9
Residue:
1424
  
Inhibitor
Name:
BDBM43159
Synonyms:
MLS000688798 N-[(5-bromo-2-thienyl)methyleneamino]-2-methyl-3-furamide N-[(5-bromothiophen-2-yl)methylideneamino]-2-methylfuran-3-carboxamide cid_696521
Type:
Small organic molecule
Emp. Form.:
C11H9BrN2O2S
Mol. Mass.:
313.17
SMILES:
Cc1occc1C(=O)NN=Cc1ccc(Br)s1
: