Target
Nuclear receptor coactivator 3
Ligand
BDBM43163
Substrate
Meas. Tech.
Dose response biochemical High Throughput Screening assay for agonists of the steroid receptor coactivator 3 (SRC-3) recruitment by the peroxisome proliferator-activated receptor gamma (PPARgamma)
EC50
>79370±n/a nM
Citation
 PubChem, PC Dose response biochemical High Throughput Screening assay for agonists of the steroid receptor coactivator 3 (SRC-3) recruitment by the peroxisome proliferator-activated receptor gamma (PPARgamma) PubChem Bioassay (2008)[AID] 
Target
Name:
Nuclear receptor coactivator 3
Synonyms:
AIB1 NCOA3 RAC3 nuclear receptor coactivator 3 isoform a
Type:
Enzyme Catalytic Domain
Mol. Mass.:
155305.29
Organism:
Homo sapiens (Human)
Description:
Q9Y6Q9
Residue:
1424
  
Inhibitor
Name:
BDBM43163
Synonyms:
MLS000712423 N-(5-heptan-3-yl-1,3,4-thiadiazol-2-yl)thiophene-2-carboxamide SMR000282190 | cid_3110211
Type:
Small organic molecule
Emp. Form.:
C14H19N3OS2
Mol. Mass.:
309.45
SMILES:
CCCCC(CC)c1nnc(NC(=O)c2cccs2)s1
: