Target
Nuclear receptor coactivator 3
Ligand
BDBM43167
Substrate
Meas. Tech.
Dose response biochemical High Throughput Screening assay for agonists of the steroid receptor coactivator 3 (SRC-3) recruitment by the peroxisome proliferator-activated receptor gamma (PPARgamma)
EC50
>79370±n/a nM
Citation
 PubChem, PC Dose response biochemical High Throughput Screening assay for agonists of the steroid receptor coactivator 3 (SRC-3) recruitment by the peroxisome proliferator-activated receptor gamma (PPARgamma) PubChem Bioassay (2008)[AID] 
Target
Name:
Nuclear receptor coactivator 3
Synonyms:
AIB1 NCOA3 RAC3 nuclear receptor coactivator 3 isoform a
Type:
Enzyme Catalytic Domain
Mol. Mass.:
155305.29
Organism:
Homo sapiens (Human)
Description:
Q9Y6Q9
Residue:
1424
  
Inhibitor
Name:
BDBM43167
Synonyms:
1-[3-(3,4-dimethylanilino)-3-keto-propyl]isonipecotic acid ethyl ester MLS000717790 cid_740689 ethyl 1-[3-[(3,4-dimethylphenyl)amino]-3-oxidanylidene-propyl]piperidine-4-carboxylate
Type:
Small organic molecule
Emp. Form.:
C19H28N2O3
Mol. Mass.:
332.4372
SMILES:
CCOC(=O)C1CCN(CCC(=O)Nc2ccc(C)c(C)c2)CC1
: