Target
Nuclear receptor coactivator 3
Ligand
BDBM43177
Substrate
Meas. Tech.
Dose response biochemical High Throughput Screening assay for agonists of the steroid receptor coactivator 3 (SRC-3) recruitment by the peroxisome proliferator-activated receptor gamma (PPARgamma)
EC50
>79370±n/a nM
Citation
 PubChem, PC Dose response biochemical High Throughput Screening assay for agonists of the steroid receptor coactivator 3 (SRC-3) recruitment by the peroxisome proliferator-activated receptor gamma (PPARgamma) PubChem Bioassay (2008)[AID] 
Target
Name:
Nuclear receptor coactivator 3
Synonyms:
AIB1 NCOA3 RAC3 nuclear receptor coactivator 3 isoform a
Type:
Enzyme Catalytic Domain
Mol. Mass.:
155305.29
Organism:
Homo sapiens (Human)
Description:
Q9Y6Q9
Residue:
1424
  
Inhibitor
Name:
BDBM43177
Synonyms:
(6E)-2,4-bis(bromanyl)-6-[[(4-fluorophenyl)methylamino]methylidene]cyclohexa-2,4-dien-1-one (6E)-2,4-dibromo-6-[[(4-fluorophenyl)methylamino]methylidene]-1-cyclohexa-2,4-dienone 2,4-dibromo-6-{[(4-fluorobenzyl)imino]methyl}benzenol SMR000338136 | cid_5524647
Type:
Small organic molecule
Emp. Form.:
C14H10Br2FNO
Mol. Mass.:
387.042
SMILES:
Oc1c(Br)cc(Br)cc1C=NCc1ccc(F)cc1
: